{"text_format":"1","workbook":"xlsx","n_sheets":11,"sheets":["ФОРМА (договор)","ФОРМА (акт)","Договор","Прил. 1 Нагрузка","Прил 2. Согласие на размещение","Прил 3. Календ.План","Прил 4. Согласие на ОПД","АКТ","Кафедры","222","Лист1"],"not_rendered":{"charts":0,"images":1,"macros":1,"external_links":0,"defined_names":7,"comments":0,"pivot_tables":0},"unopened":[],"bounds":{"document_bytes":16777216,"sheet_cells":100000,"rows_first":2000,"rows_last":500,"rows_between":2000,"halvings":0,"cell_chars":16384,"cell_head_chars":4096},"cells_cut":0,"cells_raw":0,"read":"whole","date_system":"1900"}

{"sheet":"ФОРМА (договор)","index":0,"n_rows":76,"n_cols":14,"rows_kept":76,"cut":false,"hidden":false,"merged":[[75,1,75,3],[52,1,52,13],[50,1,50,2],[73,1,73,2],[53,1,53,2],[54,1,54,2],[55,1,55,2],[56,1,56,2],[71,1,71,2],[72,1,72,2],[53,3,53,13],[54,3,54,13],[55,3,55,13],[56,3,56,13],[58,1,58,13],[22,3,22,5],[33,2,33,3],[30,4,30,12],[50,3,50,5],[44,2,44,3],[49,1,49,13],[36,2,36,3],[39,2,39,3],[40,2,40,3],[41,2,41,3],[4,3,4,5],[6,3,6,5],[9,3,9,5],[10,3,10,5],[11,3,11,5],[5,3,5,5],[5,1,5,2],[23,3,23,5],[24,3,24,5],[20,1,20,2],[19,1,19,2],[18,1,18,5],[12,3,12,5],[15,3,15,5],[16,3,16,5],[19,3,19,5],[13,3,13,5],[20,3,20,5],[21,3,21,5],[15,1,15,2],[13,1,13,2],[12,1,12,2],[21,1,21,2],[35,2,35,3],[42,2,42,3],[43,2,43,3],[34,2,34,3],[24,1,24,2],[23,1,23,2],[22,1,22,2],[30,1,31,1],[30,2,31,3],[26,1,26,13],[27,1,27,13],[28,2,28,13],[37,2,37,3],[38,2,38,3],[32,2,32,3],[0,1,0,13],[45,2,45,3],[46,2,46,3],[47,1,47,3],[16,6,16,7],[4,1,4,2],[3,1,3,2],[2,1,2,2],[29,1,29,13],[10,1,10,2],[9,1,9,2],[8,1,8,5],[14,1,14,2],[6,1,6,2],[16,1,16,2],[11,1,11,2]]}
[null,"ПЕРЕД НАЧАЛОМ РАБОТЫ С ФАЙЛОМ НЕОБХОДИМО ВКЛЮЧИТЬ СОДЕРЖИМОЕ\nЗАПОЛНЯЮТСЯ ТОЛЬКО ЗЕЛЕНЫЕ ЯЧЕЙКИ!!!"]
[]
[null,null,null,"Фамилия","Имя","Отчество"]
[null,"ФИО Исполнителя"]
[null,"Дата рождения"]
[null,"Место рождения"]
[null,"Адрес регистрации"]
[]
[null,"Паспортные данные, ИНН и страховое свидетельство"]
[null,"Серия паспорта"]
{"$rows_left_out":67}
{"sheet":"ФОРМА (акт)","index":1,"n_rows":41,"n_cols":14,"rows_kept":41,"cut":false,"hidden":false,"merged":[[27,8,27,13],[6,1,6,13],[2,1,2,2],[2,3,2,5],[0,1,0,13],[3,1,3,2],[3,3,3,5],[4,1,4,2],[4,3,4,5],[10,2,10,3],[7,1,7,13],[8,1,9,1],[8,2,9,3],[8,4,8,12],[11,2,11,3],[23,2,23,3],[12,2,12,3],[24,2,24,3],[25,1,25,3],[13,2,13,3],[14,2,14,3],[20,2,20,3],[21,2,21,3],[22,2,22,3],[15,2,15,3],[16,2,16,3],[17,2,17,3],[18,2,18,3],[19,2,19,3]]}
[null,"Строки таблиц НЕ удалять и НЕ вырезать! В противном случае данные будут отображаться некорректно!\nСерые области НЕ заполять, сумма считается автоматически!"]
[]
[null,"Дата акта",null,"2025-09-30"]
[null,"Кафедра",null,{"$f":"IF('ФОРМА (договор)'!C29=\"\",\"Заполните название на вкладке ФОРМА (договор)\",'ФОРМА (договор)'!C29)","v":"Заполните название на вкладке ФОРМА (договор)"}]
[]
[]
[]
[null,"Перечень, объем оказываемых услуг:"]
[null,"Учебная группа","Наименование дисциплины по учебному плану",null,"Нагрузка, час"]
[null,null,null,null,"лекции \n(не может быть дробным числом!)","практические занятия\n(не может быть дробным числом!)","лабораторные занятия\n(не может быть дробным числом!)","руководство/прием курсовых работ","прием зачетов/ экзаменов","руководство практикой","руководство НИР обучающихся ","участие в работе ГЭК","\n","Всего часов учебной нагрузки"]
{"$rows_left_out":32}
{"sheet":"Договор","index":2,"n_rows":101,"n_cols":10,"rows_kept":101,"cut":false,"hidden":false,"merged":[[0,0,0,9],[69,0,69,9],[70,0,70,9],[73,0,73,9],[54,0,54,9],[55,0,55,9],[43,0,43,9],[53,0,53,9],[49,0,49,9],[46,0,46,9],[38,0,38,9],[40,0,40,9],[29,0,29,9],[34,0,34,1],[39,0,39,1],[1,0,1,9],[77,0,77,9],[72,0,72,9],[85,5,85,9],[56,0,56,9],[67,0,67,9],[68,0,68,9],[59,0,59,9],[57,0,57,9],[58,0,58,9],[60,0,60,9],[62,0,62,9],[63,0,63,9],[64,0,64,9],[65,0,65,9],[84,0,84,3],[78,0,78,9],[100,0,100,3],[97,5,97,9],[100,5,100,9],[87,5,87,9],[90,5,90,9],[87,0,87,3],[88,0,88,3],[90,0,90,3],[91,5,91,6],[99,0,99,3],[92,0,93,3],[96,5,96,9],[92,5,92,9],[93,5,93,9],[94,5,94,9],[91,0,91,3],[3,0,3,3],[19,0,19,9],[20,0,20,9],[22,0,22,9],[5,0,5,9],[7,0,7,9],[6,0,6,9],[10,0,10,9],[11,0,11,9],[12,0,12,6],[14,0,14,9],[16,0,16,9],[15,0,15,3],[21,0,21,3],[9,0,9,9],[18,0,18,9],[23,0,23,9],[48,0,48,9],[45,0,45,9],[50,0,50,9],[51,0,51,9],[24,0,24,3],[27,0,27,3],[41,0,41,9],[25,0,25,9],[26,0,26,9],[42,0,42,9],[28,0,28,9],[39,2,39,9],[36,0,36,1],[30,0,30,9],[32,0,32,9],[98,5,98,9],[17,0,17,9],[95,5,95,9],[83,0,83,2],[44,0,44,9],[33,0,33,9],[34,2,34,9],[36,2,36,9],[86,0,86,3],[71,0,71,9],[74,0,74,9],[75,0,75,9],[80,0,80,9],[86,5,86,9],[76,0,76,9],[83,5,83,9]]}
["ДОГОВОР № __________________"]
["об оказании услуг физическим лицом"]
[]
["г. Санкт-Петербург ",null,null,null,null,null,null,null,null,"«____» _______________ 20___ г."]
[]
["Федеральное государственное бюджетное образовательное учреждение высшего образования  «Санкт-Петербургский государственный университет промышленных технологий и дизайна» (СПбГУПТД), именуемое в дальнейшем «Заказчик», в лице первого проректора, проректора по УР Рудина Александра Евгеньевича, действующего на основании доверенности № 38-01-01-10/01-37 от 16.01.2025 г., с одной стороны, и "]
[{"$f":"'ФОРМА (договор)'!D4&\" \"&'ФОРМА (договор)'!E4&\" \"&'ФОРМА (договор)'!F4&\",\"","v":"  ,"}]
["именуемый в дальнейшем «Исполнитель», с другой стороны, вместе именуемые «Стороны», в соответствии с Федеральным законом от 18.07.2011 № 223-ФЗ «О закупках товаров, работ, услуг отдельными видами юридических лиц», пп. 33 п.1 раздела 2 главы IV Положения о закупке Заказчика от 15.04.2022 г., заключили настоящий договор о нижеследующем:"]
[]
["1.      ПРЕДМЕТ ДОГОВОРА"]
{"$rows_left_out":92}
{"sheet":"Прил. 1 Нагрузка","index":3,"n_rows":34,"n_cols":12,"rows_kept":34,"cut":false,"hidden":false,"merged":[[33,0,33,3],[23,0,23,1],[6,0,7,0],[6,1,7,1],[6,2,6,10],[31,0,31,3],[32,0,32,3],[24,2,24,11],[25,2,25,11],[27,0,27,11],[24,0,24,1],[25,0,25,1],[6,11,7,11]]}
[null,null,null,null,null,null,null,null,null,null,null,"Приложение №1"]
[null,null,null,null,null,null,null,null,null,null,null," к договору на оказание услуг"]
[null,null,null,null,null,null,null,null,null,null,null,"физическим лицом №__________________ от _______________ г."]
[]
[]
["Перечень, объем, цена оказываемых услуг"]
["Учебная группа","Наименование дисциплины по учебному плану","Нагрузка, час",null,null,null,null,null,null,null,null,"Всего часов учебной \nнагрузки"]
[null,null,"лекции","практические занятия","лабораторные занятия","руководство/\nприем курсовых работ","прием зачетов/ экзаменов","руководство практикой","руководство НИР \nобучающихся ","участие в работе ГЭК",{"$f":"IF('ФОРМА (договор)'!M32=\"\",\"\",'ФОРМА (договор)'!M32)","v":"\n"}]
[{"$f":"IF('ФОРМА (договор)'!B33=\"\",\"\",'ФОРМА (договор)'!B33)","v":""},{"$f":"IF('ФОРМА (договор)'!C33=\"\",\"\",'ФОРМА (договор)'!C33)","v":""},{"$f":"IF('ФОРМА (договор)'!E33=\"\",\"\",'ФОРМА (договор)'!E33)","v":""},{"$f":"IF('ФОРМА (договор)'!F33=\"\",\"\",'ФОРМА (договор)'!F33)","v":""},{"$f":"IF('ФОРМА (договор)'!G33=\"\",\"\",'ФОРМА (договор)'!G33)","v":""},{"$f":"IF('ФОРМА (договор)'!H33=\"\",\"\",'ФОРМА (договор)'!H33)","v":""},{"$f":"IF('ФОРМА (договор)'!I33=\"\",\"\",'ФОРМА (договор)'!I33)","v":""},{"$f":"IF('ФОРМА (договор)'!J33=\"\",\"\",'ФОРМА (договор)'!J33)","v":""},{"$f":"IF('ФОРМА (договор)'!K33=\"\",\"\",'ФОРМА (договор)'!K33)","v":""},{"$f":"IF('ФОРМА (договор)'!L33=\"\",\"\",'ФОРМА (договор)'!L33)","v":""},{"$f":"IF('ФОРМА (договор)'!M33=\"\",\"\",'ФОРМА (договор)'!M33)","v":""},{"$f":"IF(SUM(C9:K9)=0,\"\",SUM(C9:K9))","v":""}]
[{"$f":"IF('ФОРМА (договор)'!B34=\"\",\"\",'ФОРМА (договор)'!B34)","v":""},{"$f":"IF('ФОРМА (договор)'!C34=\"\",\"\",'ФОРМА (договор)'!C34)","v":""},{"$f":"IF('ФОРМА (договор)'!E34=\"\",\"\",'ФОРМА (договор)'!E34)","v":""},{"$f":"IF('ФОРМА (договор)'!F34=\"\",\"\",'ФОРМА (договор)'!F34)","v":""},{"$f":"IF('ФОРМА (договор)'!G34=\"\",\"\",'ФОРМА (договор)'!G34)","v":""},{"$f":"IF('ФОРМА (договор)'!H34=\"\",\"\",'ФОРМА (договор)'!H34)","v":""},{"$f":"IF('ФОРМА (договор)'!I34=\"\",\"\",'ФОРМА (договор)'!I34)","v":""},{"$f":"IF('ФОРМА (договор)'!J34=\"\",\"\",'ФОРМА (договор)'!J34)","v":""},{"$f":"IF('ФОРМА (договор)'!K34=\"\",\"\",'ФОРМА (договор)'!K34)","v":""},{"$f":"IF('ФОРМА (договор)'!L34=\"\",\"\",'ФОРМА (договор)'!L34)","v":""},{"$f":"IF('ФОРМА (договор)'!M34=\"\",\"\",'ФОРМА (договор)'!M34)","v":""},{"$f":"IF(SUM(C10:K10)=0,\"\",SUM(C10:K10))","v":""}]
{"$rows_left_out":25}
{"sheet":"Прил 2. Согласие на размещение","index":4,"n_rows":34,"n_cols":6,"rows_kept":34,"cut":false,"hidden":false,"merged":[[23,0,23,5],[7,0,7,5],[9,0,9,5],[10,0,10,5],[11,0,11,5],[12,0,12,5],[13,0,13,5],[14,0,14,5],[16,0,16,5],[18,0,18,5],[20,0,20,5],[21,1,21,5],[33,2,33,3],[33,4,33,5],[25,0,25,5],[26,0,26,5],[28,0,28,5],[32,0,32,1],[32,2,32,3],[32,4,32,5]]}
[null,null,null,null,null,"Приложение №2"]
[null,null,null,null,null," к договору на оказание услуг"]
[null,null,null,null,null,"физическим лицом №__________________ от _____________ г."]
[]
[]
[]
[]
["СОГЛАСИЕ НА РАЗМЕЩЕНИЕ ЛИЧНОЙ ИНФОРМАЦИИ \nНА ИНФОРМАЦИОННЫХ РЕСУРСАХ"]
[]
[{"$f":"'ФОРМА (договор)'!D4&\" \"&'ФОРМА (договор)'!E4&\" \"&'ФОРМА (договор)'!F4","v":"  "}]
{"$rows_left_out":25}
{"sheet":"Прил 3. Календ.План","index":5,"n_rows":26,"n_cols":4,"rows_kept":26,"cut":false,"hidden":false,"merged":[[17,0,17,1],[23,0,23,1],[19,0,19,3]]}
[null,null,null,"Приложение №3"]
[null,null,null," к договору на оказание услуг"]
[null,null,null,"физическим лицом №__________________ от _______________ г."]
[]
[null,null,"Календарный план"]
[]
["Этап","Дата окончания этапа","Кол-во часов","Стоимость этапа"]
["Сентябрь",{"$f":"'ФОРМА (договор)'!C62","v":"2025-09-30"},{"$f":"'ФОРМА (договор)'!D62","v":0},{"$f":"'ФОРМА (договор)'!E62","v":0}]
["Октябрь",{"$f":"'ФОРМА (договор)'!C63","v":"2025-10-31"},{"$f":"'ФОРМА (договор)'!D63","v":0},{"$f":"'ФОРМА (договор)'!E63","v":0}]
["Ноябрь",{"$f":"'ФОРМА (договор)'!C64","v":"2025-11-28"},{"$f":"'ФОРМА (договор)'!D64","v":0},{"$f":"'ФОРМА (договор)'!E64","v":0}]
{"$rows_left_out":17}
{"sheet":"Прил 4. Согласие на ОПД","index":6,"n_rows":26,"n_cols":6,"rows_kept":26,"cut":false,"hidden":false,"merged":[[22,0,22,5],[21,0,21,5],[25,2,25,3],[25,4,25,5],[24,2,24,3],[24,4,24,5],[24,0,24,1],[7,0,7,5],[16,0,16,5],[18,0,18,5],[19,1,19,5],[9,0,9,5],[10,0,10,5],[12,0,12,5],[11,0,11,5],[14,0,14,5],[13,0,13,5]]}
[null,null,null,null,null,"Приложение №4"]
[null,null,null,null,null," к договору на оказание услуг"]
[null,null,null,null,null,"физическим лицом №__________________ от _____________ г."]
[]
[]
[]
[]
["СОГЛАСИЕ НА ОБРАБОТКУ ПЕРСОНАЛЬНЫХ ДАННЫХ"]
[]
[{"$f":"'ФОРМА (договор)'!D4&\" \"&'ФОРМА (договор)'!E4&\" \"&'ФОРМА (договор)'!F4","v":"  "}]
{"$rows_left_out":17}
{"sheet":"АКТ","index":7,"n_rows":47,"n_cols":12,"rows_kept":47,"cut":false,"hidden":false,"merged":[[40,0,40,11],[36,0,36,11],[38,0,38,11],[29,2,29,11],[30,2,30,11],[29,0,29,1],[30,0,30,1],[34,4,34,5],[39,0,39,11],[0,0,0,11],[1,0,1,11],[5,0,5,11],[7,0,7,11],[8,0,8,11],[3,5,3,11],[10,0,11,0],[10,2,10,10],[27,0,27,1],[28,0,28,1],[28,2,28,11],[10,1,11,1],[10,11,11,11]]}
["Акт сдачи-приемки оказанных услуг "]
["по договору №______________________________________от _________________"]
[]
["г. Санкт-Петербург",null,null,null,null,{"$f":"'ФОРМА (акт)'!D3","v":"2025-09-30"}]
[]
["Федеральное государственное бюджетное образовательное учреждение высшего образования «Санкт-Петербургский государственный университет промышленных технологий и дизайна», именуемое в дальнейшем «Заказчик», в лице первого проректора, проректора по УР Рудина Александра Евгеньевича, действующего на основании доверенности № 38-01-01-10/01-37 от 16.01.2025 г., с одной стороны, и"]
[]
[{"$f":"'ФОРМА (договор)'!D4&\" \"&'ФОРМА (договор)'!E4&\" \"&'ФОРМА (договор)'!F4&\",\"","v":"  ,"}]
[{"$f":"\"именуемый(-ая) в дальнейшем «Исполнитель», с другой стороны составили настоящий акт о том, что Исполнителем оказаны, а Заказчиком приняты  услуги в \"&VLOOKUP('ФОРМА (акт)'!D3,'222'!E:F,2,FALSE)&\" \"&VLOOKUP('ФОРМА (акт)'!D3,'222'!E:G,3,FALSE)&\" г. в следующем объеме:\"","v":"именуемый(-ая) в дальнейшем «Исполнитель», с другой стороны составили настоящий акт о том, что Исполнителем оказаны, а Заказчиком приняты  услуги в сентябре 2025 г. в следующем объеме:"}]
[]
{"$rows_left_out":38}
{"sheet":"Кафедры","index":8,"n_rows":57,"n_cols":9,"rows_kept":57,"cut":false,"hidden":true,"merged":[]}
[null,"Подразделение","Иерархия",null,"№"]
[{"$f":"IF(ISNUMBER(SEARCH($I$3,B2)),MAX($A$1:A1)+1,0)","v":0},"кафедра Книгоиздания и книжной торговли","Высшая школа печати и медиатехнологий",null,1,{"$f":"VLOOKUP(E2,A:B,2,FALSE)","v":{"$error":"#N/A"}},null,null,"Поиск"]
[{"$f":"IF(ISNUMBER(SEARCH($I$3,B3)),MAX($A$1:A2)+1,0)","v":0},"кафедра Гуманитарных и социально-экономических дисциплин","Высшая школа печати и медиатехнологий",null,2,{"$f":"VLOOKUP(E3,A:B,2,FALSE)","v":{"$error":"#N/A"}},null,null,{"$f":"'ФОРМА (договор)'!C29","v":0}]
[{"$f":"IF(ISNUMBER(SEARCH($I$3,B4)),MAX($A$1:A3)+1,0)","v":0},"кафедра Рекламы","Высшая школа печати и медиатехнологий",null,3,{"$error":"#N/A"}]
[{"$f":"IF(ISNUMBER(SEARCH($I$3,B5)),MAX($A$1:A4)+1,0)","v":0},"кафедра Технического перевода и профессиональных коммуникаций","Высшая школа печати и медиатехнологий",null,4,{"$error":"#N/A"}]
[{"$f":"IF(ISNUMBER(SEARCH($I$3,B6)),MAX($A$1:A5)+1,0)","v":0},"кафедра Графики","Высшая школа печати и медиатехнологий",null,5,{"$error":"#N/A"}]
[{"$f":"IF(ISNUMBER(SEARCH($I$3,B7)),MAX($A$1:A6)+1,0)","v":0},"кафедра Журналистики и медиатехнологий средств массовой информации","Высшая школа печати и медиатехнологий",null,6,{"$error":"#N/A"}]
[{"$f":"IF(ISNUMBER(SEARCH($I$3,B8)),MAX($A$1:A7)+1,0)","v":0},"кафедра Полиграфического оборудования и управления","Высшая школа печати и медиатехнологий",null,7,{"$error":"#N/A"}]
[{"$f":"IF(ISNUMBER(SEARCH($I$3,B9)),MAX($A$1:A8)+1,0)","v":0},"кафедра Технологий полиграфического производства","Высшая школа печати и медиатехнологий",null,8,{"$error":"#N/A"}]
[{"$f":"IF(ISNUMBER(SEARCH($I$3,B10)),MAX($A$1:A9)+1,0)","v":0},"кафедра Информационных и управляющих систем","Высшая школа печати и медиатехнологий",null,9,{"$error":"#N/A"}]
{"$rows_left_out":48}
{"sheet":"222","index":9,"n_rows":16,"n_cols":21,"rows_kept":16,"cut":false,"hidden":true,"merged":[[0,16,0,17]]}
[null,"месяц",null,"Месяц","Даты актов",null,null,null,null,null,null,null,"Единицы измерения",null,{"$f":"'ФОРМА (договор)'!D4&\" \"","v":" "},null,"Расчет нового акта"]
["Январь","января","январе",{"$f":"'ФОРМА (договор)'!B62","v":"Сентябрь"},{"$f":"'ФОРМА (договор)'!C62","v":"2025-09-30"},"сентябре",{"$f":"TEXT(E2,\"гггг\")","v":"2025"},null,null,null,null,null,null,null,{"$f":"LEFT('ФОРМА (договор)'!E4,1)&\".\"","v":"."},null,"Цена за ед., руб.",{"$f":"'ФОРМА (договор)'!D54","v":0}]
["Февраль","февраля","феврале",{"$f":"'ФОРМА (договор)'!B63","v":"Октябрь"},{"$f":"'ФОРМА (договор)'!C63","v":"2025-10-31"},"октябре",{"$f":"TEXT(E3,\"гггг\")","v":"2025"},null,null,null,null,null,"час",null,{"$f":"LEFT('ФОРМА (договор)'!F4,1)&\".\"","v":"."},null,"Сумма вознаграждения, включая НДФЛ, руб.",{"$f":"ROUND('ФОРМА (акт)'!N26*'ФОРМА (договор)'!D51,2)","v":0}]
["Март","марта","марте",{"$f":"'ФОРМА (договор)'!B64","v":"Ноябрь"},{"$f":"'ФОРМА (договор)'!C64","v":"2025-11-28"},"ноябре","2025",null,null,null,null,null,"усл.ед.",null,null,null,"Взносы в государственные внебюджетные фонды, руб.",{"$f":"ROUND(R3*0.3,2)","v":0}]
["Апрель","апреля","апреле",{"$f":"'ФОРМА (договор)'!B65","v":"Декабрь"},{"$f":"'ФОРМА (договор)'!C65","v":"2025-12-26"},"декабре","2025",null,null,null,null,null,null,null,null,null,"Общая стоимость услуг, руб.",{"$f":"ROUND('ФОРМА (акт)'!N26*'ФОРМА (договор)'!D54,2)","v":0}]
["Май","мая","мае",{"$f":"'ФОРМА (договор)'!B66","v":"Январь"},{"$f":"'ФОРМА (договор)'!C66","v":"2026-01-30"},"январе","2026",{"$f":"'ФОРМА (договор)'!D57","v":0},"Сумма прописью",{"$f":"'ФОРМА (договор)'!D55","v":0},"Сумма прописью",null,null,null,null,null,"1. Заказчик оплачивает вознаграждение за оказанные услуги в размере",{"$f":"ROUND(R3-R7,2)","v":0},{"$f":"СУММАПРОПИСЬЮ('222'!R6)","v":"ноль"},{"$f":"\"(\"&UPPER(LEFT(S6,1))&MID(S6,2,LEN(S6)-2)&\")\"","v":"(Нол)"},{"$f":"T6&\" руб. \"&TEXT((R6-INT(R6))*100,\"00\")&\" коп.\"","v":"(Нол) руб. 00 коп."}]
["Июнь","июня","июне",{"$f":"'ФОРМА (договор)'!B67","v":"Февраль"},{"$f":"'ФОРМА (договор)'!C67","v":"2026-02-27"},"феврале","2026",null,{"$f":"СУММАПРОПИСЬЮ('222'!H6)","v":"ноль"},null,{"$f":"СУММАПРОПИСЬЮ('222'!J6)","v":"ноль"},null,null,null,null,null,"удержав НДФЛ по ставке 13% на основании п. 1, 2, 4, 6 ст. 226 НК РФ в размере",{"$f":"ROUND(R3*0.13,0)","v":0}]
["Июль","июля","июле",{"$f":"'ФОРМА (договор)'!B68","v":"Март"},{"$f":"'ФОРМА (договор)'!C68","v":"2026-03-31"},"марте","2026",null,{"$f":"\"(\"&UPPER(LEFT(I7,1))&MID(I7,2,LEN(I7)-2)&\")\"","v":"(Нол)"},null,{"$f":"\"(\"&UPPER(LEFT(K7,1))&MID(K7,2,LEN(K7)-2)&\")\"","v":"(Нол)"},null,null,null,null,null,"2. Взносы в государственные внебюджетные фонды, перечисляемые Заказчиком в соответствии с действующим законодательством Российской Федерации по договору с физическим лицом в соответствии с законодательством РФ в размере",{"$f":"R4","v":0}]
["Август","августа","августе",{"$f":"'ФОРМА (договор)'!B69","v":"Апрель"},{"$f":"'ФОРМА (договор)'!C69","v":"2026-04-30"},"апреле","2026",null,{"$f":"I8&\" руб. \"&TEXT((H6-INT(H6))*100,\"00\")&\" коп.\"","v":"(Нол) руб. 00 коп."},null,{"$f":"K8&\" руб. \"&TEXT((J6-INT(J6))*100,\"00\")&\" коп.\"","v":"(Нол) руб. 00 коп."}]
["Сентябрь","сентября","сентябре",{"$f":"'ФОРМА (договор)'!B70","v":"Май"},{"$f":"'ФОРМА (договор)'!C70","v":"2026-05-29"},"мае","2026"]
{"$rows_left_out":7}
{"sheet":"Лист1","index":10,"n_rows":1,"n_cols":1,"rows_kept":1,"cut":false,"hidden":true,"merged":[]}
["* Включает сумму вознаграждения по договору, включая НДФЛ (13%), который Заказчик, являясь налоговым агентом, удерживает и перечисляет в бюджет, а также взносы в государственные внебюджетные фонды, перечисляемые Заказчиком в соответствии с действующим законодательством Российской Федерации (30%)"]